{"text_format":"1","workbook":"xlsx","n_sheets":4,"sheets":["Berekening","Pachtprijsgebieden Los Land","Pachtprijsgebieden Tuinland","Pachtovereenkomsten"],"not_rendered":{"charts":0,"images":1,"macros":1,"external_links":0,"defined_names":2,"comments":0,"pivot_tables":0},"unopened":[],"bounds":{"document_bytes":16777216,"sheet_cells":100000,"rows_first":2000,"rows_last":500,"rows_between":2000,"halvings":0,"cell_chars":16384,"cell_head_chars":4096},"cells_cut":0,"cells_raw":0,"read":"whole","date_system":"1900"}

{"sheet":"Berekening","index":0,"n_rows":51,"n_cols":20,"rows_kept":51,"cut":false,"hidden":false,"merged":[]}
[]
[]
[]
[null,null,null,null,"Actualisatie pachtprijs*"]
[null,null,null,null,2018]
[null,null,null,null,"* dit betreft een indicatief rekenschema, "]
[null,null,null,null,"waaraan geen rechten kunnen worden ontleend."]
[]
[null,null,"Gegevens pachtovereenkomst & pachtobject"]
[null,null,null,null,null,null,null,null,null,null,null,null,null,null,null,null,null,null,"7: 325 BW",1]
[null,null,"Pachtobject",2,null,null,null,null,null,null,null,null,null,null,null,null,null,null,"7: 388 BW",2]
[null,null,null,null,null,null,null,null,null,null,null,null,null,null,null,null,null,null,"7: 385 BW",3]
[null,null,{"$f":"IF(D11=1,\"Type pachtovereenkomst (hoeve)\",\"Type pachtovereenkomst (los land)\")","v":"Type pachtovereenkomst (los land)"},1,null,null,{"$f":"IF(D13=1,S10,IF(D13=2,S11,IF(D13=3,S12,IF(D13=4,S13,IF(D13=5,S14,IF(D13=6,S15,IF(D13=7,S16,\"ongeldige keuze\")))))))","v":"7: 325 BW"},null,null,null,null,null,null,null,null,null,null,null,"7: 397 lid 1 BW",4]
[null,null,null,null,null,null,null,null,null,null,null,null,null,null,null,null,null,null,"7: 397 lid 2 BW",5]
[null,null,"Pachtovereenkomst aangegaan",1,null,null,null,null,null,null,null,null,null,null,null,null,null,null,"7: 395 BW",6]
[null,null,null,null,null,null,null,null,null,null,null,null,null,null,null,null,null,null,"7: 396 BW",7]
[null,null,"Vrije verkeerswaarde grond (per hectare)",null,60000]
[]
[null,null,"Oude pachtprijs los land (per hectare)",false]
[null,null,"Oude pachtprijs agrarische bedrijfswoning (totaal)",null,700]
[null,null,"Oude pachtprijs agrarische bedrijfsgebouwen (totaal)"]
[]
[null,null,"Pachtnorm 2018"]
[]
[null,null,"Gemeente",null,"Rhenen"]
[null,null,"Regio tuinland",null,"Westelijk Holland"]
[]
[null,null,"Pachtprijsgebied",null,{"$f":"VLOOKUP(E25,'Pachtprijsgebieden Los Land'!A2:E439,2)","v":"Centraal veehouderijgebied"}]
[]
[null,null,"Veranderpercentage agrarische bedrijfswoning",null,{"$f":"IF(D15=1,0.039,0.014)","v":3.9E-2}]
[null,null,null,null,null,null,null,null,{"$f":"IF(D15=1,1,0)","v":1},"Voor 1-9-07",{"$f":"IF(D15=1,1,0)","v":1},"Voor 1-9-07",{"$f":"IF(D15=2,1,0)","v":0},"Na 1-9-07",{"$f":"IF(D15=2,1,0)","v":0},"Na 1-9-07"]
[null,null,"Veranderpercentage agrarische bedrijfsgebouwen",null,1.46E-2,null,null,null,{"$f":"IF(E34<0,1,0)","v":1},"Negatief",{"$f":"IF(E34>0,1,0)","v":0},"Positief",{"$f":"IF(E34<0,1,0)","v":1},"Negatief",{"$f":"IF(E34>0,1,0)","v":0},"Positief"]
[null,null,null,null,null,null,null,null,{"$f":"E19*(1+E34)","v":0},"Prijs x veranderpercentage",{"$f":"E19*(1+E34)","v":0},"Prijs x veranderpercentage",{"$f":"E36","v":467},"regionorm",{"$f":"E36","v":467},"regionorm"]
[null,null,{"$f":"IF(D19=TRUE,\"Veranderpercentage (tuinland)\",\"Veranderpercentage (los land)\")","v":"Veranderpercentage (los land)"},null,{"$f":"IF(D19=FALSE,VLOOKUP(E25,'Pachtprijsgebieden Los Land'!A2:E439,5),IF(E26=\"Westelijk Holland\",0.31,-0.025))","v":-0.26},null,null,null,0.9,"Minimale verandering t.o.v. regionorm",1.1000000000000001,"Maximal verandering t.o.v. regionorm"]
[null,null,null,null,null,null,null,null,{"$f":"E36*I34","v":420.3},"Grenswaarde",{"$f":"K34*E36","v":513.70000000000005},"Grenswaarde"]
[null,null,"Regionorm",null,{"$f":"IF(D19=FALSE,VLOOKUP(E25,'Pachtprijsgebieden Los Land'!A2:E439,4),IF(E26=\"Westelijk Holland\",2380,811))","v":467},null,null,null,{"$f":"IF(I33<I35,I35,I33)","v":420.3},null,{"$f":"IF(K33>K35,K35,K33)","v":0}]
[null,null,null,null,null,null,null,null,{"$f":"IF(E19<I36,E19,I36)*I32*I31","v":0},null,{"$f":"IF(E19>K36,E19,K36)*K32*K31","v":0}]
[null,null,"Nieuwe prijzen",null,null,null,null,null,{"$f":"2%*$E$17","v":1200},"2% van vrije verkeerswaarde",{"$f":"2%*$E$17","v":1200},"2% van vrije verkeerswaarde",{"$f":"2%*$E$17*M32*M31","v":0},"2% van vrije verkeerswaarde",{"$f":"2%*$E$17*O31*O32","v":0},"2% van vrije verkeerswaarde"]
[null,null,null,null,null,null,null,null,"Negatief",null,{"$f":"IF(K37>K38,K38,K37)","v":0},null,{"$f":"IF(M33>M38,M38,M33)","v":0},null,{"$f":"IF(O33>O38,O38,O33)","v":0}]
[null,null,"Nieuwe pachtprijs los land (per hectare)",null,{"$f":"IF(D11=1,(SUM(I39,K39,M39,O39)),IF(D13=1,(SUM(I39,K39,M39,O39)),IF(D13=2,\"onderzoeken\",IF(D13=3,\"onderzoeken\",IF(D13=4,\"volgens contract\",IF(D13=5,(SUM(I39,K39,M39,O39)),IF(D13=6,\"volgens contract\",IF(D13=7,\"volgens contract\",\"\"))))))))","v":0},null,{"$f":"IF(D15=1,\"*\",\"\")","v":"*"}]
[null,null,{"$f":"IF($D$11=1,\"Nieuwe pachtprijs agrarische bedrijfswoning\",\"\")","v":""},null,{"$f":"IF(D11=1,E20*(1+E30),\"\")","v":""}]
[null,null,{"$f":"IF($D$11=2,\"\",\"Nieuwe pachtprijs agrarische bedrijfsgebouwen\")","v":""},null,{"$f":"IF(D11=1,E21*(1+E32),\"\")","v":""}]
[]
[null,null,"NB: Indien er sprake is van gebruiksbeperkende bepalingen bij pacht van los land en de pachter hiervoor geen"]
[null,null,"vergoeding ontvangt van de overheid, heeft hij recht op een korting t.o.v. de hoogst toelaatbare pachtprijs."]
[]
[null,null,"* de pachtprijzen werken van rechtswege door. Deze gewijzigde pachtprijzen hoeven niet voorgelegd te worden"]
[null,null,"aan de Grondkamer. De verpachter kan schriftelijk geheel of gedeeltelijk afzien van een verhoging. De van"]
[null,null,"toepassing zijnde pachtprijs hoeft niet de hoogt toelaatbare pachtprijs te zijn."]
[]
[null,null,"Voor aanvullende vragen en/of opmerkingen neem contact op via info@hackrentmeesters.nl"]

{"sheet":"Pachtprijsgebieden Los Land","index":1,"n_rows":439,"n_cols":5,"rows_kept":439,"cut":false,"hidden":true,"merged":[]}
["Gemeente","Pachtprijsgebied","Regio","Regionorn","Veranderpercentage"]
["’s-Gravenhage","Westelijk Holland",7,548,-0.16]
["’s-Hertogenbosch","Rivierengebied",10,631,-0.27]
["Aa en Hunze","Veenkoloniën en Oldambt",2,640,-0.14000000000000001]
["Aalburg","Rivierengebied",10,631,-0.27]
["Aalsmeer","Westelijk Holland",7,548,-0.16]
["Aalten","Oostelijk veehouderijgebied",4,608,-0.19]
["Abcoude","Hollands/Utrechts weidegebied",9,706,-0.24]
["Achtkarspelen","Noordelijk weidegebied",3,586,-0.26]
["Alblasserdam","Hollands/Utrechts weidegebied",9,706,-0.24]
["Albrandswaard","Westelijk Holland",7,548,-0.16]
["Alkmaar","Westelijk Holland",7,548,-0.16]
["Almelo","Oostelijk veehouderijgebied",4,608,-0.19]
["Almere","Ijsselmeerpolders",6,1125,7.0000000000000007E-2]
["Alphen aan den Rijn","Hollands/Utrechts weidegebied",9,706,-0.24]
["Alphen-Chaam","Zuidelijk veehouderijgebied",13,550,-0.34]
["Ameland","Noordelijk weidegebied",3,586,-0.26]
["Amersfoort","Hollands/Utrechts weidegebied",9,706,-0.24]
["Amstelveen","Westelijk Holland",7,548,-0.16]
["Amsterdam","Waterland en Droogmakerijen",8,296,-0.28999999999999998]
["Andijk","Westelijk Holland",7,548,-0.16]
["Apeldoorn","Centraal veehouderijgebied",5,467,-0.26]
["Appingedam","Veenkoloniën en Oldambt",2,640,-0.14000000000000001]
["Arcen en Velden","Zuidelijk veehouderijgebied",13,550,-0.34]
["Arnhem","Rivierengebied",10,631,-0.27]
["Assen","Veenkoloniën en Oldambt",2,640,-0.14000000000000001]
["Asten","Zuidelijk veehouderijgebied",13,550,-0.34]
["Baarle-Nassau","Zuidelijk veehouderijgebied",13,550,-0.34]
["Baarn","Hollands/Utrechts weidegebied",9,706,-0.24]
["Barendrecht","Westelijk Holland",7,548,-0.16]
["Barneveld","Centraal veehouderijgebied",5,467,-0.26]
["Bedum","Noordelijk weidegebied",3,586,-0.26]
["Beek","Zuid-Limburg",14,718,-0.18]
["Beemster","Waterland en Droogmakerijen",8,296,-0.28999999999999998]
["Beesel","Zuidelijk veehouderijgebied",13,550,-0.34]
["Bellingwedde","Veenkoloniën en Oldambt",2,640,-0.14000000000000001]
["Bergambacht","Hollands/Utrechts weidegebied",9,706,-0.24]
["Bergeijk","Zuidelijk veehouderijgebied",13,550,-0.34]
["Bergen (L)","Zuidelijk veehouderijgebied",13,550,-0.34]
["Bergen (NH)","Westelijk Holland",7,548,-0.16]
["Bergen op Zoom","Zuidwest Brabant",12,740,-0.05]
["Berkelland","Oostelijk veehouderijgebied",4,608,-0.19]
["Bernheze","Zuidelijk veehouderijgebied",13,550,-0.34]
["Bernisse","Zuidwestelijk akkerbouwgebied",11,505,-0.02]
["Best","Zuidelijk veehouderijgebied",13,550,-0.34]
["Beuningen","Oostelijk veehouderijgebied",4,608,-0.19]
["Beverwijk","Westelijk Holland",7,548,-0.16]
["Binnenmaas","Zuidwestelijk akkerbouwgebied",11,505,-0.02]
["Bladel","Zuidelijk veehouderijgebied",13,550,-0.34]
["Blaricum","Hollands/Utrechts weidegebied",9,706,-0.24]
["Bloemendaal","Westelijk Holland",7,548,-0.16]
["Boarnsterhim","Noordelijk weidegebied",3,586,-0.26]
["Bodegraven","Hollands/Utrechts weidegebied",9,706,-0.24]
["Boekel","Zuidelijk veehouderijgebied",13,550,-0.34]
["Bolsward","Noordelijk weidegebied",3,586,-0.26]
["Borger-Odoorn","Veenkoloniën en Oldambt",2,640,-0.14000000000000001]
["Borne","Oostelijk veehouderijgebied",4,608,-0.19]
["Borsele","Zuidwestelijk akkerbouwgebied",11,505,-0.02]
["Boskoop","Westelijk Holland",7,548,-0.16]
["Boxmeer","Zuidelijk veehouderijgebied",13,550,-0.34]
["Boxtel","Zuidelijk veehouderijgebied",13,550,-0.34]
["Breda","Zuidwest Brabant",12,740,-0.05]
["Breukelen","Hollands/Utrechts weidegebied",9,706,-0.24]
["Brielle","Zuidwestelijk akkerbouwgebied",11,505,-0.02]
["Bronckhorst","Oostelijk veehouderijgebied",4,608,-0.19]
["Brummen","Oostelijk veehouderijgebied",4,608,-0.19]
["Brunssum","Zuid-Limburg",14,718,-0.18]
["Bunnik","Rivierengebied",10,631,-0.27]
["Bunschoten","Hollands/Utrechts weidegebied",9,706,-0.24]
["Buren","Rivierengebied",10,631,-0.27]
["Bussum","Hollands/Utrechts weidegebied",9,706,-0.24]
["Capelle aan den IJssel","Westelijk Holland",7,548,-0.16]
["Castricum","Westelijk Holland",7,548,-0.16]
["Coevorden","Oostelijk veehouderijgebied",4,608,-0.19]
["Cranendonck","Zuidelijk veehouderijgebied",13,550,-0.34]
["Cromstrijen","Zuidwestelijk akkerbouwgebied",11,505,-0.02]
["Cuijk","Zuidelijk veehouderijgebied",13,550,-0.34]
["Culemborg","Rivierengebied",10,631,-0.27]
["Dalfsen","Noordelijk weidegebied",3,586,-0.26]
["Dantumadiel","Noordelijk weidegebied",3,586,-0.26]
["De Bilt","Hollands/Utrechts weidegebied",9,706,-0.24]
["De Marne","Bouwhoek en Hogeland",1,653,-0.04]
["De Ronde Venen","Hollands/Utrechts weidegebied",9,706,-0.24]
["De Wolden","Noordelijk weidegebied",3,586,-0.26]
["Delft","Westelijk Holland",7,548,-0.16]
["Delfzijl","Veenkoloniën en Oldambt",2,640,-0.14000000000000001]
["Den Helder","Westelijk Holland",7,548,-0.16]
["Deurne","Zuidelijk veehouderijgebied",13,550,-0.34]
["Deventer","Oostelijk veehouderijgebied",4,608,-0.19]
["Diemen","Hollands/Utrechts weidegebied",9,706,-0.24]
["Dinkelland","Oostelijk veehouderijgebied",4,608,-0.19]
["Dirksland","Zuidwestelijk akkerbouwgebied",11,505,-0.02]
["Doesburg","Oostelijk veehouderijgebied",4,608,-0.19]
["Doetinchem","Oostelijk veehouderijgebied",4,608,-0.19]
["Dongen","Zuidelijk veehouderijgebied",13,550,-0.34]
["Dongeradeel","Bouwhoek en Hogeland",1,653,-0.04]
["Dordrecht","Zuidwestelijk akkerbouwgebied",11,505,-0.02]
["Drechterland","Westelijk Holland",7,548,-0.16]
["Drimmelen","Zuidelijk veehouderijgebied",13,550,-0.34]
["Dronten","Ijsselmeerpolders",6,1125,7.0000000000000007E-2]
["Druten","Oostelijk veehouderijgebied",4,608,-0.19]
["Duiven","Oostelijk veehouderijgebied",4,608,-0.19]
["Echt-Susteren","Zuidelijk veehouderijgebied",13,550,-0.34]
["Edam-Volendam","Waterland en Droogmakerijen",8,296,-0.28999999999999998]
["Ede","Centraal veehouderijgebied",5,467,-0.26]
["Eemnes","Hollands/Utrechts weidegebied",9,706,-0.24]
["Eemsmond","Bouwhoek en Hogeland",1,653,-0.04]
["Eersel","Zuidelijk veehouderijgebied",13,550,-0.34]
["Eijsden","Zuid-Limburg",14,718,-0.18]
["Eindhoven","Zuidelijk veehouderijgebied",13,550,-0.34]
["Elburg","Centraal veehouderijgebied",5,467,-0.26]
["Emmen","Veenkoloniën en Oldambt",2,640,-0.14000000000000001]
["Enkhuizen","Westelijk Holland",7,548,-0.16]
["Enschede","Oostelijk veehouderijgebied",4,608,-0.19]
["Epe","Centraal veehouderijgebied",5,467,-0.26]
["Ermelo","Centraal veehouderijgebied",5,467,-0.26]
["Etten-Leur","Zuidwest Brabant",12,740,-0.05]
["Ferwerderadiel","Bouwhoek en Hogeland",1,653,-0.04]
["Franekeradeel","Bouwhoek en Hogeland",1,653,-0.04]
["Gaasterlân-Sleat","Noordelijk weidegebied",3,586,-0.26]
["Geertruidenberg","Zuidelijk veehouderijgebied",13,550,-0.34]
["Geldermalsen","Rivierengebied",10,631,-0.27]
["Geldrop-Mierlo","Zuidelijk veehouderijgebied",13,550,-0.34]
["Gemert-Bakel","Zuidelijk veehouderijgebied",13,550,-0.34]
["Gennep","Zuidelijk veehouderijgebied",13,550,-0.34]
["Giessenlanden","Hollands/Utrechts weidegebied",9,706,-0.24]
["Gilze en Rijen","Zuidelijk veehouderijgebied",13,550,-0.34]
["Goedereede","Zuidwestelijk akkerbouwgebied",11,505,-0.02]
["Goes","Zuidwestelijk akkerbouwgebied",11,505,-0.02]
["Goirle","Zuidelijk veehouderijgebied",13,550,-0.34]
["Gorinchem","Hollands/Utrechts weidegebied",9,706,-0.24]
["Gouda","Hollands/Utrechts weidegebied",9,706,-0.24]
["Graafstroom","Hollands/Utrechts weidegebied",9,706,-0.24]
["Graft-De Rijp","Waterland en Droogmakerijen",8,296,-0.28999999999999998]
["Grave","Zuidelijk veehouderijgebied",13,550,-0.34]
["Groesbeek","Oostelijk veehouderijgebied",4,608,-0.19]
["Groningen","Noordelijk weidegebied",3,586,-0.26]
["Grootegast","Noordelijk weidegebied",3,586,-0.26]
["Gulpen-Wittem","Zuid-Limburg",14,718,-0.18]
["Haaksbergen","Oostelijk veehouderijgebied",4,608,-0.19]
["Haaren","Zuidelijk veehouderijgebied",13,550,-0.34]
["Haarlem","Westelijk Holland",7,548,-0.16]
["Haarlemmerliede en Spaarnwoude","Waterland en Droogmakerijen",8,296,-0.28999999999999998]
["Haarlemmermeer","Westelijk Holland",7,548,-0.16]
["Halderberge","Zuidwest Brabant",12,740,-0.05]
["Hardenberg","Oostelijk veehouderijgebied",4,608,-0.19]
["Harderwijk","Centraal veehouderijgebied",5,467,-0.26]
["Hardinxveld-Giessendam","Hollands/Utrechts weidegebied",9,706,-0.24]
["Haren","Noordelijk weidegebied",3,586,-0.26]
["Harenkarspel","Westelijk Holland",7,548,-0.16]
["Harlingen","Bouwhoek en Hogeland",1,653,-0.04]
["Hattem","Centraal veehouderijgebied",5,467,-0.26]
["Heemskerk","Westelijk Holland",7,548,-0.16]
["Heemstede","Westelijk Holland",7,548,-0.16]
["Heerde","Centraal veehouderijgebied",5,467,-0.26]
["Heerenveen","Noordelijk weidegebied",3,586,-0.26]
["Heerhugowaard","Westelijk Holland",7,548,-0.16]
["Heerlen","Zuid-Limburg",14,718,-0.18]
["Heeze-Leende","Zuidelijk veehouderijgebied",13,550,-0.34]
["Heiloo","Westelijk Holland",7,548,-0.16]
["Helden","Zuidelijk veehouderijgebied",13,550,-0.34]
["Hellendoorn","Oostelijk veehouderijgebied",4,608,-0.19]
["Hellevoetsluis","Zuidwestelijk akkerbouwgebied",11,505,-0.02]
["Helmond","Zuidelijk veehouderijgebied",13,550,-0.34]
["Hendrik-Ido-Ambacht","Westelijk Holland",7,548,-0.16]
["Hengelo","Oostelijk veehouderijgebied",4,608,-0.19]
["Het Bildt","Bouwhoek en Hogeland",1,653,-0.04]
["Heumen","Oostelijk veehouderijgebied",4,608,-0.19]
["Heusden","Rivierengebied",10,631,-0.27]
["Hillegom","Westelijk Holland",7,548,-0.16]
["Hilvarenbeek","Zuidelijk veehouderijgebied",13,550,-0.34]
["Hilversum","Hollands/Utrechts weidegebied",9,706,-0.24]
["Hof van Twente","Oostelijk veehouderijgebied",4,608,-0.19]
["Hollands Kroon","Westelijk Holland",7,548,-0.16]
["Hoogeveen","Oostelijk veehouderijgebied",4,608,-0.19]
["Hoogezand-Sappemeer","Veenkoloniën en Oldambt",2,640,-0.14000000000000001]
["Hoorn","Westelijk Holland",7,548,-0.16]
["Horst aan de Maas","Zuidelijk veehouderijgebied",13,550,-0.34]
["Houten","Rivierengebied",10,631,-0.27]
["Huizen","Hollands/Utrechts weidegebied",9,706,-0.24]
["Hulst","Zuidwestelijk akkerbouwgebied",11,505,-0.02]
["IJsselstein","Hollands/Utrechts weidegebied",9,706,-0.24]
["Kaag en Braassem","Westelijk Holland",7,548,-0.16]
["Kampen","Noordelijk weidegebied",3,586,-0.26]
["Kapelle","Zuidwestelijk akkerbouwgebied",11,505,-0.02]
["Katwijk","Westelijk Holland",7,548,-0.16]
["Kerkrade","Zuid-Limburg",14,718,-0.18]
["Kessel","Zuidelijk veehouderijgebied",13,550,-0.34]
["Koggenland","Westelijk Holland",7,548,-0.16]
["Kollumerland en Nieuwkruisland","Bouwhoek en Hogeland",1,653,-0.04]
["Korendijk","Zuidwestelijk akkerbouwgebied",11,505,-0.02]
["Krimpen aan den IJssel","Hollands/Utrechts weidegebied",9,706,-0.24]
["Laarbeek","Zuidelijk veehouderijgebied",13,550,-0.34]
["Landerd","Zuidelijk veehouderijgebied",13,550,-0.34]
["Landgraaf","Zuid-Limburg",14,718,-0.18]
["Landsmeer","Waterland en Droogmakerijen",8,296,-0.28999999999999998]
["Langedijk","Westelijk Holland",7,548,-0.16]
["Lansingerland","Westelijk Holland",7,548,-0.16]
["Laren","Hollands/Utrechts weidegebied",9,706,-0.24]
["Leek","Noordelijk weidegebied",3,586,-0.26]
{"$rows_left_out":240}
{"sheet":"Pachtprijsgebieden Tuinland","index":2,"n_rows":3,"n_cols":5,"rows_kept":3,"cut":false,"hidden":true,"merged":[]}
["Gemeente","Pachtprijsgebied","Regio","Regionorn","Veranderpercentage"]
["Westelijk Holland","Westelijk Holland",14,3108,0.15]
["Overig Nederland","Overig Nederland",15,2071,0.22]

{"sheet":"Pachtovereenkomsten","index":3,"n_rows":9,"n_cols":7,"rows_kept":9,"cut":false,"hidden":true,"merged":[]}
["Sluitingsdatum","Tuinland","Pachtobject","Pachtovereenkomst","Pachtovereenkomst","Titel"]
[]
["voor 1 september 2007","Ja","Hoeve (eventueel met los land)","Reguliere pacht",{"$f":"D3","v":"Reguliere pacht"},"7: 325 BW",1]
["na 1 september 2007","Nee","Los Land","Reservaat pacht",{"$f":"D4","v":"Reservaat pacht"},"7: 388 BW",2]
[null,null,null,"Verpachting door openbare lichamen",{"$f":"D5","v":"Verpachting door openbare lichamen"},"7: 385 BW",3]
[null,null,null,"Geliberaliseerde pacht 0 tot 6 jaar",{"$f":"IF(Berekening!$D$11=2,D6,\"\")","v":"Geliberaliseerde pacht 0 tot 6 jaar"},"7: 397 lid 1 BW",4]
[null,null,null,"Geliberaliseerde pacht 6 tot 12 jaar",{"$f":"IF(Berekening!$D$11=2,D7,\"\")","v":"Geliberaliseerde pacht 6 tot 12 jaar"},"7: 397 lid 2 BW",5]
[null,null,null,"Niet groter dan 1 hectare",{"$f":"IF(Berekening!$D$11=2,D8,\"\")","v":"Niet groter dan 1 hectare"},"7: 395 BW",6]
[null,null,null,"Teeltpacht",{"$f":"IF(Berekening!$D$11=2,D9,\"\")","v":"Teeltpacht"},"7: 396 BW",7]